Target
Alpha-2A adrenergic receptor
Ligand
BDBM50056401
Substrate
Ki
>10000±n/a nM
Comments
PDSP_1689
Citation
 Buchheit, KHGamse, RPfannkuche, HJ SDZ 205-557, a selective, surmountable antagonist for 5-HT4 receptors in the isolated guinea pig ileum. Naunyn Schmiedebergs Arch Pharmacol 345:387-93 (1992)  
Target
Name:
Alpha-2A adrenergic receptor
Synonyms:
ADA2A_BOVIN Alpha-2A adrenergic receptor Alpha-2A adrenoreceptor Alpha-2D adrenergic receptor Cerebral cortex alpha adrenergic receptor adrenergic Alpha2D
Type:
Enzyme Catalytic Domain
Mol. Mass.:
49275.13
Organism:
BOVINE
Description:
adrenergic Alpha2 0 BOVINE::Q28838
Residue:
452
  
Inhibitor
Name:
BDBM50056401
Synonyms:
2-diethylaminoethyl [2-methoxy-4-amino-5-chloro]benzoate CHEMBL287045 SDZ-205557
Type:
Small organic molecule
Emp. Form.:
C14H21ClN2O3
Mol. Mass.:
300.781
SMILES:
CCN(CC)CCOC(=O)c1cc(Cl)c(N)cc1OC
: