Target
Alpha-2B adrenergic receptor
Ligand
BDBM60917
Substrate
Ki
91±n/a nM
Comments
PDSP_812
Citation
 Blaxall, HSMurphy, TJBaker, JCRay, CBylund, DB Characterization of the alpha-2C adrenergic receptor subtype in the opossum kidney and in the OK cell line. J Pharmacol Exp Ther 259:323-9 (1991) Target
Name:
Alpha-2B adrenergic receptor
Synonyms:
ADA2B_RAT Adrenergic receptor alpha Alpha-2B adrenergic receptor Alpha-2B adrenoreceptor | adrenergic Alpha2B
Type:
Enzyme Catalytic Domain
Mol. Mass.:
50379.83
Organism:
NEONATAL RAT
Description:
adrenergic Alpha2B ADRA2B NEONATAL RAT::P19328
Residue:
453
  
Inhibitor
Name:
BDBM60917
Synonyms:
9-chloranyl-5-(4-hydroxyphenyl)-2,3,4,5-tetrahydro-1H-3-benzazepine-7,8-diol;methanesulfonic acid 9-chloro-5-(4-hydroxyphenyl)-2,3,4,5-tetrahydro-1H-3-benzazepine-7,8-diol;methanesulfonic acid FENOLDOPAM MESYLATE SMR000469190 | cid_49659
Type:
Small organic molecule
Emp. Form.:
C16H16ClNO3
Mol. Mass.:
305.756
SMILES:
Oc1ccc(cc1)C1CNCCc2c(Cl)c(O)c(O)cc12
: