Target
Alpha-2B adrenergic receptor
Ligand
BDBM81808
Substrate
Ki
1.9±n/a nM
Comments
PDSP_1967
Citation
 Blaxall, HSMurphy, TJBaker, JCRay, CBylund, DB Characterization of the alpha-2C adrenergic receptor subtype in the opossum kidney and in the OK cell line. J Pharmacol Exp Ther 259:323-9 (1991) Target
Name:
Alpha-2B adrenergic receptor
Synonyms:
ADA2B_RAT Adrenergic receptor alpha Alpha-2B adrenergic receptor Alpha-2B adrenoreceptor | adrenergic Alpha2B
Type:
Enzyme Catalytic Domain
Mol. Mass.:
50379.83
Organism:
NEONATAL RAT
Description:
adrenergic Alpha2B ADRA2B NEONATAL RAT::P19328
Residue:
453
  
Inhibitor
Name:
BDBM81808
Synonyms:
CAS_133816 WY 26392
Type:
Small organic molecule
Emp. Form.:
C17H26N2O2S
Mol. Mass.:
322.466
SMILES:
CCCS(=O)(=O)N(C)C1CCN2CCc3ccccc3C2C1
: