Target
D(2) dopamine receptor
Ligand
BDBM81790
Substrate
Ki
1.7±n/a nM
Comments
PDSP_287
Citation
 Sokoloff, PGiros, BMartres, MPBouthenet, MLSchwartz, JC Molecular cloning and characterization of a novel dopamine receptor (D3) as a target for neuroleptics. Nature 347:146-51 (1990)  
Target
Name:
D(2) dopamine receptor
Synonyms:
DOPAMINE D2 DOPAMINE D2 Short Dopamine D2 receptor Drd2
Type:
G Protein-Coupled Receptor (GPCR)
Mol. Mass.:
50931.60
Organism:
Rattus norvegicus (rat)
Description:
P61169
Residue:
444
  
Inhibitor
Name:
BDBM81790
Synonyms:
Amisulpride NSC_2159 US10259786, Amisulpride
Type:
Small organic molecule
Emp. Form.:
C17H27N3O4S
Mol. Mass.:
369.479
SMILES:
CCN1CCCC1CNC(=O)c1cc(c(N)cc1OC)S(=O)(=O)CC
: