Target
Adenosine receptor A1
Ligand
BDBM21173
Substrate
Ki
0.21±n/a nM
Comments
PDSP_739
Citation
 Klotz, KNVogt, HTawfik-Schlieper, H Comparison of A1 adenosine receptors in brain from different species by radioligand binding and photoaffinity labelling. Naunyn Schmiedebergs Arch Pharmacol 343:196-201 (1991)  
Target
Name:
Adenosine receptor A1
Synonyms:
AA1R_RABIT ADENOSINE A1 high ADORA1 | Adenosine receptor A1 (A1)
Type:
Enzyme
Mol. Mass.:
36566.33
Organism:
Oryctolagus cuniculus (Rabbit)
Description:
P34970
Residue:
328
  
Inhibitor
Name:
BDBM21173
Synonyms:
1,3-dipropyl-8-cyclopentylxanthine CHEMBL183 PD116948 | [3H]DPCPX
Type:
radiolabeled ligand
Emp. Form.:
C16H24N4O2
Mol. Mass.:
304.3874
SMILES:
CCCn1c2nc([nH]c2c(=O)n(CCC)c1=O)C1CCCC1
: