Target
Platelet-activating factor receptor
Ligand
BDBM50005232
Substrate
Ki
1.4±n/a nM
Comments
PDSP_595
Citation
 Tahraoui, LFloch, ACavero, I Functional validation of platelet-activating factor receptor sites characterized biochemically by a specific and reproducible [3H]platelet-activating factor binding in human platelets. J Pharmacol Exp Ther 252:1221-7 (1990) Target
Name:
Platelet-activating factor receptor
Synonyms:
PAF Platelet activating factor PAFR PTAFR_HUMAN Platelet-activating factor receptor
Type:
Enzyme Catalytic Domain
Mol. Mass.:
39219.60
Organism:
Homo sapiens (Human)
Description:
PAF Platelet activating factor PTAFR HUMAN::P25105
Residue:
342
  
Inhibitor
Name:
BDBM50005232
Synonyms:
(R)-2-{[Acetyl-(2-methoxy-3-octadecylcarbamoyloxy-propoxycarbonyl)-amino]-methyl}-1-ethyl-pyridinium; chloride 2-{[Acetyl-(2-methoxy-3-octadecylcarbamoyloxy-propoxycarbonyl)-amino]-methyl}-1-ethyl-pyridinium; chloride CHEMBL274420 | CV-6209
Type:
Small organic molecule
Emp. Form.:
C34H60N3O6
Mol. Mass.:
606.8562
SMILES:
(=O)OCC(COC(=O)N(Cc1cccc[n+]1CC)C(C)=O)OC
: