Target
Muscarinic acetylcholine receptor M2
Ligand
BDBM81960
Substrate
Ki
200±n/a nM
Comments
PDSP_930
Citation
 Buckley, NJBonner, TIBuckley, CMBrann, MR Antagonist binding properties of five cloned muscarinic receptors expressed in CHO-K1 cells. Mol Pharmacol 35:469-76 (1989) Target
Name:
Muscarinic acetylcholine receptor M2
Synonyms:
ACM2_HUMAN Cholinergic, muscarinic M2 Muscarinic acetylcholine receptor M2 and M5 | RecName: Full=Muscarinic acetylcholine receptor M2
Type:
GPCR
Mol. Mass.:
51730.61
Organism:
Homo sapiens (Human)
Description:
P08172
Residue:
466
  
Inhibitor
Name:
BDBM81960
Synonyms:
CAS_113010-69-8 hexahydrodifenidol
Type:
Small organic molecule
Emp. Form.:
C21H33NO
Mol. Mass.:
315.4928
SMILES:
OC(CCCN1CCCCC1)(C1CCCCC1)c1ccccc1
: