Target
Histamine H3 receptor
Ligand
BDBM22914
Substrate
Ki
2±n/a nM
Comments
PDSP_1847
Citation
 Arrang, JMGarbarg, MLancelot, JCLecomte, JMPollard, HRobba, MSchunack, WSchwartz, JC Highly potent and selective ligands for a new class H3 of histamine receptor. Invest Radiol 0:0-2 (1988)  
Target
Name:
Histamine H3 receptor
Synonyms:
HISTAMINE H3 HRH3_CAVPO | Histamine H3 receptor
Type:
Enzyme Catalytic Domain
Mol. Mass.:
48753.61
Organism:
GUINEA PIG
Description:
HISTAMINE H3 HRH3 GUINEA PIG::Q9JI35
Residue:
445
  
Inhibitor
Name:
BDBM22914
Synonyms:
CHEMBL260374 Thioperamide | US11622967, Compound Thioperamide
Type:
Small organic molecule
Emp. Form.:
C15H24N4S
Mol. Mass.:
292.443
SMILES:
S=C(NC1CCCCC1)N1CCC(CC1)c1cnc[nH]1
: