Target
Histamine H1 receptor
Ligand
BDBM112777
Substrate
Ki
8.4±n/a nM
Comments
PDSP_1363
Citation
 Kanba, SRichelson, E Histamine H1 receptors in human brain labelled with [3H]doxepin. Brain Res 304:1-7 (1984)  
Target
Name:
Histamine H1 receptor
Synonyms:
H1R HISTAMINE H1 HRH1_HUMAN
Type:
G Protein-Coupled Receptor (GPCR)
Mol. Mass.:
55808.72
Organism:
Homo sapiens (Human)
Description:
Cell pellets from SK-N-MC cells transfected with human H1 receptor were used in binding assay.
Residue:
487
  
Inhibitor
Name:
BDBM112777
Synonyms:
NORTRIPTYLINE | US8629135, SW-02
Type:
Small organic molecule
Emp. Form.:
C19H21N
Mol. Mass.:
263.3767
SMILES:
[#6]-[#7]-[#6]-[#6]\[#6]=[#6]-1/c2ccccc2-[#6]-[#6]-c2ccccc-12
: