Target
Carbonic anhydrase 6
Ligand
BDBM50137675
Substrate
Meas. Tech.
Enzyme Inhbition Assay
pH
7.5±0
Temperature
293.15±0 K
Ki
3.5±0 nM
Citation
 Winum, JYMontero, JLVullo, DSupuran, CT Carbonic anhydrase inhibitors: glycosylsulfanilamides act as subnanomolar inhibitors of the human secreted isoform VI. Chem Biol Drug Des 74:636-9 (2009)  
Target
Name:
Carbonic anhydrase 6
Synonyms:
CA-VI CAH6_HUMAN Carbonic Anhydrase VI Carbonic anhydrase 6 Carbonic anhydrase 6 (CA-VI) Salivary carbonic anhydrase | Secreted carbonic anhydrase
Type:
Enzyme
Mol. Mass.:
35371.40
Organism:
Homo sapiens (Human)
Description:
P23280
Residue:
308
  
Inhibitor
Name:
BDBM50137675
Synonyms:
4-(3,4,5-Trihydroxy-tetrahydro-pyran-2-ylamino)-benzenesulfonamide N-(p-sulfamoylphenyl)-alpha-glycopyranosylamine, 4 N-(p-sulfamoylphenyl)-alpha-glycopyranosylamine, 6
Type:
Small organic molecule
Emp. Form.:
C11H16N2O6S
Mol. Mass.:
304.32
SMILES:
NS(=O)(=O)c1ccc(NC2OCC(O)C(O)C2O)cc1
: