Target
Carbonic anhydrase 6
Ligand
BDBM11638
Substrate
Meas. Tech.
Enzyme Inhbition Assay
pH
7.5±0
Temperature
293.15±0 K
Ki
0.8±0 nM
Citation
 Winum, JYMontero, JLVullo, DSupuran, CT Carbonic anhydrase inhibitors: glycosylsulfanilamides act as subnanomolar inhibitors of the human secreted isoform VI. Chem Biol Drug Des 74:636-9 (2009)  
Target
Name:
Carbonic anhydrase 6
Synonyms:
CA-VI CAH6_HUMAN Carbonic Anhydrase VI Carbonic anhydrase 6 Carbonic anhydrase 6 (CA-VI) Salivary carbonic anhydrase | Secreted carbonic anhydrase
Type:
Enzyme
Mol. Mass.:
35371.40
Organism:
Homo sapiens (Human)
Description:
P23280
Residue:
308
  
Inhibitor
Name:
BDBM11638
Synonyms:
CHEMBL26 N-[(1-ethylpyrrolidin-2-yl)methyl]-2-methoxy-5-sulfamoylbenzamide SULPIRIDE,(-) Sulpiride, SLP US10172837, Sulpiride
Type:
Small organic molecule
Emp. Form.:
C15H23N3O4S
Mol. Mass.:
341.426
SMILES:
CCN1CCCC1CNC(=O)c1cc(ccc1OC)S(N)(=O)=O
: