Target
Prostaglandin D2 receptor
Ligand
BDBM82213
Substrate
Ki
19±n/a nM
Comments
PDSP_1458
Citation
 Shimizu, TYamashita, AHayaishi, O Specific binding of prostaglandin D2 to rat brain synaptic membrane. Occurrence, properties, and distribution. J Biol Chem 257:13570-5 (1982) Target
Name:
Prostaglandin D2 receptor
Synonyms:
PD2R_RAT Prostaglandin D2 receptor | Ptgdr
Type:
Enzyme Catalytic Domain
Mol. Mass.:
39786.91
Organism:
RAT
Description:
Prostaglandin D2 PTGDR RAT::Q9R261
Residue:
357
  
Inhibitor
Name:
BDBM82213
Synonyms:
CAS_41598-07-6 PGD2
Type:
Small organic molecule
Emp. Form.:
C20H30O4
Mol. Mass.:
334.4498
SMILES:
CCCCCC(O)CC=C1C(CC=CCCCC(O)=O)C=CC1=O
: