Target
Sodium-dependent serotonin transporter
Ligand
BDBM112777
Substrate
Ki
1700±n/a nM
Comments
PDSP_1363
Citation
 Koe, BKWeissman, AWelch, WMBrowne, RG Sertraline, 1S,4S-N-methyl-4-(3,4-dichlorophenyl)-1,2,3,4-tetrahydro-1-naphthylamine, a new uptake inhibitor with selectivity for serotonin. J Pharmacol Exp Ther 226:686-700 (1983) Target
Name:
Sodium-dependent serotonin transporter
Synonyms:
5-HT Transporter 5HT transporter Anandamid membrane transporter, AMT Monoamine transporters; Norepinephrine & serotonin Slc6a4 Sodium-dependent serotonin transporter (SERT) | imipramine receptor
Type:
Multi-pass membrane protein
Mol. Mass.:
70168.43
Organism:
Rattus norvegicus (rat)
Description:
P31652
Residue:
630
  
Inhibitor
Name:
BDBM112777
Synonyms:
NORTRIPTYLINE | US8629135, SW-02
Type:
Small organic molecule
Emp. Form.:
C19H21N
Mol. Mass.:
263.3767
SMILES:
[#6]-[#7]-[#6]-[#6]\[#6]=[#6]-1/c2ccccc2-[#6]-[#6]-c2ccccc-12
: