Target
Thromboxane A2 receptor
Ligand
BDBM50020300
Substrate
Ki
>10000±n/a nM
Comments
PDSP_1467
Citation
 Armstrong, RAJones, RLWilson, NH Ligand binding to thromboxane receptors on human platelets: correlation with biological activity. Br J Pharmacol 79:953-64 (1983)  
Target
Name:
Thromboxane A2 receptor
Synonyms:
TA2R_MOUSE Thromboxane A2
Type:
Enzyme Catalytic Domain
Mol. Mass.:
37114.77
Organism:
MOUSE
Description:
Thromboxane A2 TBXA2R MOUSE::P30987
Residue:
341
  
Inhibitor
Name:
BDBM50020300
Synonyms:
(S-isomer)7-[3,5-Dihydroxy-2-(3-hydroxy-oct-1-enyl)-cyclopentyl]-hept-5-enoic acid 7-[3,5-Dihydroxy-2-(3-hydroxy-oct-1-enyl)-cyclopentyl]-hept-5-enoic acid PGF2Alpha | Prostaglandin F2alpha7-[3,5-Dihydroxy-2-(3-hydroxy-oct-1-enyl)-cyclopentyl]-hept-5-enoic acid
Type:
Small organic molecule
Emp. Form.:
C20H34O5
Mol. Mass.:
354.481
SMILES:
CCCCC[C@H](O)\C=C\C1[C@H](O)C[C@H](O)[C@@H]1C\C=C/CCCC(O)=O
: