Target
Metabotropic glutamate receptor 4
Ligand
BDBM50053589
Substrate
Ki
>10000±n/a nM
Comments
PDSP_4811
Citation
 Thomsen, CBoel, ESuzdak, PD Actions of phenylglycine analogs at subtypes of the metabotropic glutamate receptor family. Eur J Pharmacol 267:77-84 (1994)  
Target
Name:
Metabotropic glutamate receptor 4
Synonyms:
GRM4_RAT Grm4 Metabotropic glutamate receptor 4 (mGlu4) mGlu4 metabotropic glutamate 4a
Type:
Enzyme
Mol. Mass.:
101849.79
Organism:
Rattus norvegicus (Rat)
Description:
P31423
Residue:
912
  
Inhibitor
Name:
BDBM50053589
Synonyms:
(S)-3-Hydroxyphenylglycine 3HPG | CHEMBL442347
Type:
Small organic molecule
Emp. Form.:
C8H9NO3
Mol. Mass.:
167.162
SMILES:
N[C@H](C(O)=O)c1cccc(O)c1
: