Target
Gamma-aminobutyric acid receptor subunit alpha-1
Ligand
BDBM25878
Substrate
Ki
1.37±n/a nM
Comments
PDSP_828
Citation
 Giorgi, OLecca, DCancedda, ESerra, GPCorda, MG Modulation of [35S]TBPS binding by ligands with preferential affinity for benzodiazepine BZ1 sites in the cerebral cortex of newborn and adult rats. Eur J Pharmacol 290:37-47 (1995)  
Target
Name:
Gamma-aminobutyric acid receptor subunit alpha-1
Synonyms:
Benzodiazepine central GABA A Benzodiazepine GABA A Benzodiazepine Type II GABA A Benzodiazepine Type IIM GABA A Benzodiazepine omega2 GABA A alpha1 GABA receptor alpha-1 subunit GABA-PICROTOXIN Gabra-1 TBPS
Type:
Enzyme
Mol. Mass.:
51770.21
Organism:
Rattus norvegicus (Rat)
Description:
P62813
Residue:
455
  
Inhibitor
Name:
BDBM25878
Synonyms:
5-(2-fluorophenyl)-1-methyl-7-nitro-2,3-dihydro-1H-1,4-benzodiazepin-2-one Flunitrazepam [3H]flunitrazepam
Type:
radiolabeled ligand
Emp. Form.:
C16H12FN3O3
Mol. Mass.:
313.2832
SMILES:
CN1c2ccc(cc2C(=NCC1=O)c1ccccc1F)[N+]([O-])=O
: