Target
Muscarinic acetylcholine receptor M1
Ligand
BDBM86698
Substrate
Ki
0.25±n/a nM
Comments
PDSP_347
Citation
 Lazareno, SBuckley, NJRoberts, FF Characterization of muscarinic M4 binding sites in rabbit lung, chicken heart, and NG108-15 cells. Mol Pharmacol 38:805-15 (1990) Target
Name:
Muscarinic acetylcholine receptor M1
Synonyms:
ACM1_RAT Chrm-1 cholinergic receptor, muscarinic 1
Type:
Enzyme Catalytic Domain
Mol. Mass.:
51390.46
Organism:
RAT
Description:
P08482
Residue:
460
  
Inhibitor
Name:
BDBM86698
Synonyms:
BENZTROPINE CHEMBL116590 | NSC_2344
Type:
Small organic molecule
Emp. Form.:
C21H25NO
Mol. Mass.:
307.4293
SMILES:
CN1C2CCC1CC(C2)OC(c1ccccc1)c1ccccc1
: