Target
Muscarinic acetylcholine receptor M1
Ligand
BDBM50010101
Substrate
Ki
0.62±n/a nM
Comments
PDSP_3900
Citation
 Lazareno, SBuckley, NJRoberts, FF Characterization of muscarinic M4 binding sites in rabbit lung, chicken heart, and NG108-15 cells. Mol Pharmacol 38:805-15 (1990) Target
Name:
Muscarinic acetylcholine receptor M1
Synonyms:
ACM1_RAT Chrm-1 cholinergic receptor, muscarinic 1
Type:
Enzyme Catalytic Domain
Mol. Mass.:
51390.46
Organism:
RAT
Description:
P08482
Residue:
460
  
Inhibitor
Name:
BDBM50010101
Synonyms:
2-(diethylamino)ethyl 1-cyclohexylcyclohexanecarboxylate Bicyclohexyl-1-carboxylic acid 2-diethylamino-ethyl ester DICYCLOMINE | Dicycloverin
Type:
Small organic molecule
Emp. Form.:
C19H35NO2
Mol. Mass.:
309.4867
SMILES:
CCN(CC)CCOC(=O)C1(CCCCC1)C1CCCCC1
: