Target
Muscarinic acetylcholine receptor M3
Ligand
BDBM50062614
Substrate
Ki
97.72±n/a nM
Comments
PDSP_3903
Citation
 Lazareno, SBuckley, NJRoberts, FF Characterization of muscarinic M4 binding sites in rabbit lung, chicken heart, and NG108-15 cells. Mol Pharmacol 38:805-15 (1990) Target
Name:
Muscarinic acetylcholine receptor M3
Synonyms:
ACM3_RAT Chrm-3 | Chrm3
Type:
Enzyme Catalytic Domain
Mol. Mass.:
66086.66
Organism:
RAT
Description:
Cholinergic, muscarinic M3 CHRM3 RAT::P08483
Residue:
589
  
Inhibitor
Name:
BDBM50062614
Synonyms:
CHEMBL900 Disipal N,N-dimethyl-2-(phenyl(o-tolyl)methoxy)ethanamine Norgesic Orphengesic
Type:
Small organic molecule
Emp. Form.:
C18H23NO
Mol. Mass.:
269.3813
SMILES:
CN(C)CCOC(c1ccccc1)c1ccccc1C
: