Target
Alpha-1A adrenergic receptor
Ligand
BDBM82383
Substrate
Ki
2.5±n/a nM
Comments
PDSP_3883
Citation
 Megens, AALeysen, JEAwouters, FHNiemegeers, CJ Further validation of in vivo and in vitro pharmacological procedures for assessing the alpha 2/alpha 1-selectivity of test compounds: (1). Alpha-adrenoceptor antagonists. Eur J Pharmacol 129:49-55 (1986)  
Target
Name:
Alpha-1A adrenergic receptor
Synonyms:
ADA1A_RAT Adra1c Alpha-1A adrenoceptor Alpha-1C adrenergic receptor | adrenergic Alpha1A
Type:
Protein
Mol. Mass.:
51620.15
Organism:
Rattus norvegicus (Rat)
Description:
P43140
Residue:
466
  
Inhibitor
Name:
BDBM82383
Synonyms:
CAS_26388 NSC_26388
Type:
Small organic molecule
Emp. Form.:
C22H27N3O3S2
Mol. Mass.:
445.598
SMILES:
CS(=O)(=O)c1ccc2Sc3ccccc3N(CCCN3CCC(CC3)C(N)=O)c2c1
: