Target
Alpha-2C adrenergic receptor
Ligand
BDBM50019848
Substrate
Ki
7.6±n/a nM
Comments
PDSP_959
Citation
 Megens, AALeysen, JEAwouters, FHNiemegeers, CJ Further validation of in vivo and in vitro pharmacological procedures for assessing the alpha 2/alpha 1-selectivity of test compounds: (1). Alpha-adrenoceptor antagonists. Eur J Pharmacol 129:49-55 (1986)  
Target
Name:
Alpha-2C adrenergic receptor
Synonyms:
ADA2C_RAT Adrenergic receptor alpha adrenergic Alpha2 | adrenergic Alpha2C
Type:
Enzyme Catalytic Domain
Mol. Mass.:
49890.50
Organism:
RAT
Description:
adrenergic Alpha2 0 RAT::P22086
Residue:
458
  
Inhibitor
Name:
BDBM50019848
Synonyms:
2-(2,3-dihydro-1,4-benzodioxin-2-yl)-4,5-dihydro-1H-imidazole CHEMBL10316 US8633208, Idazoxan
Type:
Small organic molecule
Emp. Form.:
C11H12N2O2
Mol. Mass.:
204.2252
SMILES:
C1CN=C(N1)C1COc2ccccc2O1
: