Target
5-hydroxytryptamine receptor 4
Ligand
BDBM50005836
Substrate
Ki
122±n/a nM
Comments
PDSP_530
Citation
 Gerald, CAdham, NKao, HTOlsen, MALaz, TMSchechter, LEBard, JAVaysse, PJHartig, PRBranchek, TA The 5-HT4 receptor: molecular cloning and pharmacological characterization of two splice variants. EMBO J 14:2806-15 (1995) Target
Name:
5-hydroxytryptamine receptor 4
Synonyms:
5-HT-4 5-HT4L 5-hydroxytryptamine receptor 4 Htr4 Serotonin 4 (5-HT4) receptor
Type:
Enzyme Catalytic Domain
Mol. Mass.:
46117.31
Organism:
RAT
Description:
5-HT4 HTR4 RAT::Q62758
Residue:
406
  
Inhibitor
Name:
BDBM50005836
Synonyms:
4-Amino-5-chloro-N-{1-[3-(4-fluoro-phenoxy)-propyl]-3-methoxy-piperidin-4-yl}-2-methoxy-benzamide CHEMBL560739 PROPULSID US10800776, Example Cisapride cid_5311047
Type:
Small organic molecule
Emp. Form.:
C23H29ClFN3O4
Mol. Mass.:
465.945
SMILES:
COC1CN(CCCOc2ccc(F)cc2)CCC1NC(=O)c1cc(Cl)c(N)cc1OC
: