Target
Alpha-1B adrenergic receptor
Ligand
BDBM81444
Substrate
Ki
7.94±n/a nM
Comments
PDSP_1955
Citation
 Schwinn, DAJohnston, GIPage, SOMosley, MJWilson, KHWorman, NPCampbell, SFidock, MDFurness, LMParry-Smith, DJ Cloning and pharmacological characterization of human alpha-1 adrenergic receptors: sequence corrections and direct comparison with other species homologues. J Pharmacol Exp Ther 272:134-42 (1995) Target
Name:
Alpha-1B adrenergic receptor
Synonyms:
ADA1B_MESAU adrenergic Alpha1
Type:
Enzyme Catalytic Domain
Mol. Mass.:
56514.13
Organism:
HAMSTER
Description:
adrenergic Alpha1 0 HAMSTER::P18841
Residue:
515
  
Inhibitor
Name:
BDBM81444
Synonyms:
CAS_185453 WB 4101 | WB-4101
Type:
Small organic molecule
Emp. Form.:
C25H27NO5
Mol. Mass.:
421.4856
SMILES:
COc1cccc(OC)c1OCCNCC1Oc2ccccc2OC1c1ccccc1
: