Target
5-hydroxytryptamine receptor 1A
Ligand
BDBM112777
Substrate
Ki
294±n/a nM
Comments
PDSP_1363
Citation
 Cusack, BNelson, ARichelson, E Binding of antidepressants to human brain receptors: focus on newer generation compounds. Psychopharmacology (Berl) 114:559-65 (1994)  
Target
Name:
5-hydroxytryptamine receptor 1A
Synonyms:
5-HT-1A 5-hydroxytryptamine receptor 1A (5-HT-1A) ADRB2RL1 Dopamine D2 receptor and serotonin 1a receptor HTR1A | Serotonin receptor 1A
Type:
Mol. Mass.:
46122.49
Organism:
Homo sapiens (Human)
Description:
Residue:
422
  
Inhibitor
Name:
BDBM112777
Synonyms:
NORTRIPTYLINE | US8629135, SW-02
Type:
Small organic molecule
Emp. Form.:
C19H21N
Mol. Mass.:
263.3767
SMILES:
[#6]-[#7]-[#6]-[#6]\[#6]=[#6]-1/c2ccccc2-[#6]-[#6]-c2ccccc-12
: