Target
Alpha-2C adrenergic receptor
Ligand
BDBM81773
Substrate
Ki
8.7±n/a nM
Comments
PDSP_340
Citation
 O'Rourke, MFBlaxall, HSIversen, LJBylund, DB Characterization of [3H]RX821002 binding to alpha-2 adrenergic receptor subtypes. J Pharmacol Exp Ther 268:1362-7 (1994) Target
Name:
Alpha-2C adrenergic receptor
Synonyms:
ADA2C_RAT Adrenergic receptor alpha adrenergic Alpha2 | adrenergic Alpha2C
Type:
Enzyme Catalytic Domain
Mol. Mass.:
49890.50
Organism:
RAT
Description:
adrenergic Alpha2 0 RAT::P22086
Residue:
458
  
Inhibitor
Name:
BDBM81773
Synonyms:
BAM 1303 CAS_115219-10-8
Type:
Small organic molecule
Emp. Form.:
C25H25BrN4
Mol. Mass.:
461.397
SMILES:
CN1C[C@H](Cn2ccnc2-c2ccccc2)C[C@H]2[C@H]1Cc1c(Br)[nH]c3cccc2c13
: