Target
Alpha-2A adrenergic receptor
Ligand
BDBM50030623
Substrate
Ki
144.54±n/a nM
Comments
PDSP_1716
Citation
 O'Rourke, MFBlaxall, HSIversen, LJBylund, DB Characterization of [3H]RX821002 binding to alpha-2 adrenergic receptor subtypes. J Pharmacol Exp Ther 268:1362-7 (1994) Target
Name:
Alpha-2A adrenergic receptor
Synonyms:
ADA2A_BOVIN Alpha-2A adrenergic receptor Alpha-2A adrenoreceptor Alpha-2D adrenergic receptor Cerebral cortex alpha adrenergic receptor adrenergic Alpha2D
Type:
Enzyme Catalytic Domain
Mol. Mass.:
49275.13
Organism:
BOVINE
Description:
adrenergic Alpha2 0 BOVINE::Q28838
Residue:
452
  
Inhibitor
Name:
BDBM50030623
Synonyms:
6-Chloro-3-methyl-9-(3-methyl-but-2-enyloxy)-2,3,4,5-tetrahydro-1H-benzo[d]azepine SK&F-104078 SKF 104078
Type:
Small organic molecule
Emp. Form.:
C16H22ClNO
Mol. Mass.:
279.805
SMILES:
[#6]-[#7]-1-[#6]-[#6]-c2c(Cl)ccc(-[#8]-[#6]\[#6]=[#6](\[#6])-[#6])c2-[#6]-[#6]-1
: