Target
Alpha-2A adrenergic receptor
Ligand
BDBM81444
Substrate
Ki
2.18±n/a nM
Comments
PDSP_1955
Citation
 O'Rourke, MFBlaxall, HSIversen, LJBylund, DB Characterization of [3H]RX821002 binding to alpha-2 adrenergic receptor subtypes. J Pharmacol Exp Ther 268:1362-7 (1994) Target
Name:
Alpha-2A adrenergic receptor
Synonyms:
ADA2A_HUMAN ADRA2R Adrenergic alpha2A Alpha-2 adrenergic receptor subtype C10 Alpha-2A adrenoreceptor alpha-2A adrenergic receptor [Homo sapiens]
Type:
Enzyme
Mol. Mass.:
48979.91
Organism:
Homo sapiens (Human)
Description:
P08913
Residue:
450
  
Inhibitor
Name:
BDBM81444
Synonyms:
CAS_185453 WB 4101 | WB-4101
Type:
Small organic molecule
Emp. Form.:
C25H27NO5
Mol. Mass.:
421.4856
SMILES:
COc1cccc(OC)c1OCCNCC1Oc2ccccc2OC1c1ccccc1
: