Target
Hrh3 protein
Ligand
BDBM22884
Substrate
Ki
65±n/a nM
Comments
PDSP_975
Citation
 Ligneau, XGarbarg, MVizuete, MLDiaz, JPurand, KStark, HSchunack, WSchwartz, JC [125I]iodoproxyfan, a new antagonist to label and visualize cerebral histamine H3 receptors. J Pharmacol Exp Ther 271:452-9 (1994) Target
Name:
Hrh3 protein
Synonyms:
HISTAMINE H3 Hrh3 protein
Type:
Enzyme Catalytic Domain
Mol. Mass.:
37860.96
Organism:
RAT
Description:
Q5PPG3
Residue:
344
  
Inhibitor
Name:
BDBM22884
Synonyms:
2-[3-(1H-imidazol-5-yl)propyl]-1-(2-{[(5-methyl-1H-imidazol-4-yl)methyl]sulfanyl}ethyl)guanidine Impromidine
Type:
Small organic molecule
Emp. Form.:
C14H23N7S
Mol. Mass.:
321.444
SMILES:
Cc1nc[nH]c1CSCCN=C(N)NCCCc1cnc[nH]1
: