Target
Alpha-2A adrenergic receptor
Ligand
BDBM50020192
Substrate
Ki
3.36±n/a nM
Comments
PDSP_1743
Citation
 O'Rourke, MFIversen, LJLomasney, JWBylund, DB Species orthologs of the alpha-2A adrenergic receptor: the pharmacological properties of the bovine and rat receptors differ from the human and porcine receptors. J Pharmacol Exp Ther 271:735-40 (1994) Target
Name:
Alpha-2A adrenergic receptor
Synonyms:
Alpha-2A adrenergic receptor adrenergic Alpha2A
Type:
Enzyme Catalytic Domain
Mol. Mass.:
48998.96
Organism:
PIG
Description:
adrenergic Alpha2 0 PIG::P18871
Residue:
450
  
Inhibitor
Name:
BDBM50020192
Synonyms:
8-(2,3-Dihydro-benzo[1,4]dioxin-2-ylmethyl)-1-phenyl-1,3,8-triaza-spiro[4.5]decan-4-one Spiroxatrine
Type:
Small organic molecule
Emp. Form.:
C22H25N3O3
Mol. Mass.:
379.4522
SMILES:
O=C1NCN(c2ccccc2)C11CCN(CC2COc3ccccc3O2)CC1
: