Target
5-hydroxytryptamine receptor 5B
Ligand
BDBM21392
Substrate
Ki
1.28±n/a nM
Comments
PDSP_140
Citation
 Boess, FGMartin, IL Molecular biology of 5-HT receptors. Neuropharmacology 33:275-317 (1994)  
Target
Name:
5-hydroxytryptamine receptor 5B
Synonyms:
5-HT5B 5HT5B_RAT Htr5b Serotonin 5b (5-HT5b) receptor
Type:
Enzyme Catalytic Domain
Mol. Mass.:
41141.95
Organism:
RAT
Description:
5-HT5B 0 RAT::P35365
Residue:
370
  
Inhibitor
Name:
BDBM21392
Synonyms:
3-(2-aminoethyl)-1H-indole-5-carboxamide 5-CT,DP CHEMBL1256863 [3H]-5-CT [3H]-5-Carboxyamidotryptamine | [3H]-5-carboxamidotryptamine
Type:
Small organic molecule
Emp. Form.:
C11H13N3O
Mol. Mass.:
203.2404
SMILES:
NCCc1c[nH]c2ccc(cc12)C(N)=O
: