Target
Adenosine receptor A2a
Ligand
BDBM1
Substrate
Ki
>10000±n/a nM
Comments
PDSP_2565
Citation
 van Galen, PJvan Bergen, AHGallo-Rodriguez, CMelman, NOlah, MEIJzerman, APStiles, GLJacobson, KA A binding site model and structure-activity relationships for the rat A3 adenosine receptor. Mol Pharmacol 45:1101-11 (1994) Target
Name:
Adenosine receptor A2a
Synonyms:
AA2AR_RAT Adenosine A2 receptor Adenosine Receptors A2a (A2a) Adenosine receptors A2a Rat striatal adenosine A2a receptor
Type:
G Protein-Coupled Receptor (GPCR)
Mol. Mass.:
45015.65
Organism:
Rattus norvegicus (rat)
Description:
Rat A2A receptors expressed in CHO cells.
Residue:
410
  
Inhibitor
Name:
BDBM1
Synonyms:
dT | thymidine
Type:
Nucleoside or nucleotide
Emp. Form.:
C10H14N2O5
Mol. Mass.:
242.2286
SMILES:
Cc1cn([C@H]2C[C@H](O)[C@@H](CO)O2)c(=O)[nH]c1=O
: