Target
Muscarinic acetylcholine receptor M1
Ligand
BDBM50048392
Substrate
Ki
>10000±n/a nM
Comments
PDSP_444
Citation
 Stanton, TBolden-Watson, CCusack, BRichelson, E Antagonism of the five cloned human muscarinic cholinergic receptors expressed in CHO-K1 cells by antidepressants and antihistaminics. Biochem Pharmacol 45:2352-4 (1993)  
Target
Name:
Muscarinic acetylcholine receptor M1
Synonyms:
ACM1_HUMAN Cholinergic receptor, muscarinic 1 | Cholinergic, muscarinic M1
Type:
Protein
Mol. Mass.:
51442.54
Organism:
Homo sapiens (Human)
Description:
P11229
Residue:
460
  
Inhibitor
Name:
BDBM50048392
Synonyms:
2-(tert-butylamino)-1-(3-chlorophenyl)propan-1-one BUPROPION HYDROCHLORIDE US9944618, Compound ID No. 176
Type:
Small organic molecule
Emp. Form.:
C13H18ClNO
Mol. Mass.:
239.741
SMILES:
CC(NC(C)(C)C)C(=O)c1cccc(Cl)c1
: