Target
5-hydroxytryptamine receptor 7
Ligand
BDBM50017721
Substrate
Ki
123±n/a nM
Comments
PDSP_606
Citation
 Bard, JAZgombick, JAdham, NVaysse, PBranchek, TAWeinshank, RL Cloning of a novel human serotonin receptor (5-HT7) positively linked to adenylate cyclase. J Biol Chem 268:23422-6 (1993) Target
Name:
5-hydroxytryptamine receptor 7
Synonyms:
5-HT-7 5-HT7 5-HT7S 5HT7 HTR7 | Serotonin receptor 7
Type:
G Protein-Coupled Receptor (GPCR)
Mol. Mass.:
53573.08
Organism:
Homo sapiens (Human)
Description:
P34969
Residue:
479
  
Inhibitor
Name:
BDBM50017721
Synonyms:
1-Methyl-4-(5H-dibenzo(a,d)cycloheptenylidene)piperidine 4-(5-dibenzo(a,d)cyclohepten-5-ylidine)-1-methylpiperidine 4-(5H-dibenzo[a,d][7]annulen-5-ylidene)-1-methylpiperidine4-(5H-dibenzo[a,d]cyclohepten-5-ylidene)-1-methylpiperidine CHEMBL516 | CYPROHEPTADINE
Type:
Small organic molecule
Emp. Form.:
C21H21N
Mol. Mass.:
287.3981
SMILES:
[#6]-[#7]-1-[#6]-[#6]\[#6](-[#6]-[#6]-1)=[#6]-1/c2ccccc2-[#6]=[#6]-c2ccccc-12
: