Target
5-hydroxytryptamine receptor 3A
Ligand
BDBM50007872
Substrate
Ki
3981±n/a nM
Comments
PDSP_399
Citation
 Bonhaus, DWLoury, DNJakeman, LBTo, ZDeSouza, AEglen, RMWong, EH [3H]BIMU-1, a 5-hydroxytryptamine3 receptor ligand in NG-108 cells, selectively labels sigma-2 binding sites in guinea pig hippocampus. J Pharmacol Exp Ther 267:961-70 (1993) Target
Name:
5-hydroxytryptamine receptor 3A
Synonyms:
5-HT3 5HT3A_CAVPO HTR3 Serotonin 3a (5-HT3a) receptor
Type:
Enzyme Catalytic Domain
Mol. Mass.:
55657.07
Organism:
GUINEA PIG
Description:
5-HT3 HTR3A GUINEA PIG::O70212
Residue:
490
  
Inhibitor
Name:
BDBM50007872
Synonyms:
3-Ethyl-2-oxo-2,3-dihydro-benzoimidazole-1-carboxylic acid (8-methyl-8-aza-bicyclo[3.2.1]oct-3-yl)-amide; hydrochloride CHEMBL544755 | CHEMBL62023
Type:
Small organic molecule
Emp. Form.:
C18H24N4O2
Mol. Mass.:
328.4088
SMILES:
CCn1c2ccccc2n(C(=O)NC2CC3CCC(C2)N3C)c1=O
: