Target
5-hydroxytryptamine receptor 2A
Ligand
BDBM50280934
Substrate
Ki
1445.43±n/a nM
Comments
PDSP_1803
Citation
 Millan, MJCanton, HGobert, ALejeune, FRivet, JMBervoets, KBrocco, MWiddowson, PMennini, TAudinot, V Novel benzodioxopiperazines acting as antagonists at postsynaptic 5-HT1A receptors and as agonists at 5-HT1A autoreceptors: a comparative pharmacological characterization with proposed 5-HT1A antagonists. J Pharmacol Exp Ther 268:337-52 (1994) Target
Name:
5-hydroxytryptamine receptor 2A
Synonyms:
5-HT-2A 5-HT2A 5-hydroxytryptamine receptor 2A (5HT2A) Htr2 Serotonin Receptor 2A
Type:
G Protein-Coupled Receptor (GPCR)
Mol. Mass.:
52852.05
Organism:
Rattus norvegicus (rat)
Description:
Rat cortex membranes 5-HT2A receptors.
Residue:
471
  
Inhibitor
Name:
BDBM50280934
Synonyms:
1-tert-Butylamino-3-(thiochroman-8-yloxy)-propan-2-ol CHEMBL434200 Tertatolol
Type:
Small organic molecule
Emp. Form.:
C16H25NO2S
Mol. Mass.:
295.44
SMILES:
CC(C)(C)NCC(O)COc1cccc2CCCSc12
: