Target
Apelin receptor
Ligand
BDBM80050
Substrate
Meas. Tech.
SAR analysis counterscreen of small molecule antagonists of the CCR6 receptor using an APJ receptor luminescent beta-arrestin assay
IC50
>66600±n/a nM
Citation
 PubChem, PC SAR analysis counterscreen of small molecule antagonists of the CCR6 receptor using an APJ receptor luminescent beta-arrestin assay PubChem Bioassay (2011)[AID] 
Target
Name:
Apelin receptor
Synonyms:
AGTRL1 APJ_HUMAN Angiotensin receptor-like 1 Apelin receptor (APJ) G-protein coupled receptor HG11
Type:
Enzyme Catalytic Domain
Mol. Mass.:
42664.06
Organism:
Homo sapiens (Human)
Description:
P35414
Residue:
380
  
Inhibitor
Name:
BDBM80050
Synonyms:
4-(1-o-toluoylisonipecotoyl)piperazine-1-carboxylic acid ethyl ester 4-[[1-[(2-methylphenyl)-oxomethyl]-4-piperidinyl]-oxomethyl]-1-piperazinecarboxylic acid ethyl ester SMR000612162 ethyl 4-[1-(2-methylbenzoyl)piperidine-4-carbonyl]piperazine-1-carboxylate | ethyl 4-[1-(2-methylphenyl)carbonylpiperidin-4-yl]carbonylpiperazine-1-carboxylate
Type:
Small organic molecule
Emp. Form.:
C21H29N3O4
Mol. Mass.:
387.4727
SMILES:
CCOC(=O)N1CCN(CC1)C(=O)C1CCN(CC1)C(=O)c1ccccc1C
: