Target
Phospholipase A2
Ligand
BDBM35905
Substrate
Meas. Tech.
Dose response counterscreen of uHTS hits for ATG4B inhibitors in a Phospholipase A2 assay
IC50
7740±n/a nM
Citation
 PubChem, PC Dose response counterscreen of uHTS hits for ATG4B inhibitors in a Phospholipase A2 assay PubChem Bioassay (2011)[AID] 
Target
Name:
Phospholipase A2
Synonyms:
Group IB phospholipase A2 PLA2 PLA2G1B Phosphatidylcholine 2-acylhydrolase 1B Phospholipase A2 group 1B | phospholipase A2 precursor
Type:
Protein
Mol. Mass.:
16364.13
Organism:
Homo sapiens (Human)
Description:
P04054
Residue:
148
  
Inhibitor
Name:
BDBM35905
Synonyms:
Tolfenamic acid flufenamic acid analogue, 32
Type:
Small organic molecule
Emp. Form.:
C14H12ClNO2
Mol. Mass.:
261.704
SMILES:
Cc1c(Cl)cccc1Nc1ccccc1C(O)=O
: