Target
Gamma-aminobutyric acid receptor subunit alpha-1
Ligand
BDBM50017320
Substrate
Ki
1.5±n/a nM
Comments
PDSP_415
Citation
 Giusti, PDucić, IPuia, GArban, RWalser, AGuidotti, ACosta, E Imidazenil: a new partial positive allosteric modulator of gamma-aminobutyric acid (GABA) action at GABAA receptors. J Pharmacol Exp Ther 266:1018-28 (1993) Target
Name:
Gamma-aminobutyric acid receptor subunit alpha-1
Synonyms:
Benzodiazepine central GABA A Benzodiazepine GABA A Benzodiazepine Type II GABA A Benzodiazepine Type IIM GABA A Benzodiazepine omega2 GABA A alpha1 GABA receptor alpha-1 subunit GABA-PICROTOXIN Gabra-1 TBPS
Type:
Enzyme
Mol. Mass.:
51770.21
Organism:
Rattus norvegicus (Rat)
Description:
P62813
Residue:
455
  
Inhibitor
Name:
BDBM50017320
Synonyms:
8-Bromo-7-oxo-3b,4,5,6-tetrahydro-7H-2,6a,11b-triaza-benzo[g]cyclopenta[e]azulene-3-carboxylic acid tert-butyl ester CHEMBL444045 | Ro-16-6028
Type:
Small organic molecule
Emp. Form.:
C19H20BrN3O3
Mol. Mass.:
418.284
SMILES:
CC(C)(C)OC(=O)c1ncn-2c1C1CCCN1C(=O)c1c(Br)cccc-21
: