Target
G-protein coupled receptor 84
Ligand
BDBM50239178
Substrate
Meas. Tech.
ChEMBL_1665423 (CHEMBL4015219)
EC50
>10000±n/a nM
Citation
 Pillaiyar, TKöse, MSylvester, KWeighardt, HThimm, DBorges, GFörster, Ivon Kügelgen, IMüller, CE Diindolylmethane Derivatives: Potent Agonists of the Immunostimulatory Orphan G Protein-Coupled Receptor GPR84. J Med Chem 60:3636-3655 (2017)  
Target
Name:
G-protein coupled receptor 84
Synonyms:
EX33 GPR84 Inflammation-related G-protein coupled receptor EX33
Type:
PROTEIN
Mol. Mass.:
43726.73
Organism:
Homo sapiens (Human)
Description:
ChEMBL_116040
Residue:
396
  
Inhibitor
Name:
BDBM50239178
Synonyms:
CHEMBL1939127
Type:
Small organic molecule
Emp. Form.:
C23H18N2O
Mol. Mass.:
338.4018
SMILES:
Oc1ccc(cc1)C(c1c[nH]c2ccccc12)c1c[nH]c2ccccc12
: