Target
Carbonic anhydrase 7
Ligand
BDBM50239278
Substrate
Meas. Tech.
ChEMBL_1665869 (CHEMBL4015665)
Ki
0.190000±n/a nM
Citation
 Bruno, EBuemi, MRDi Fiore, ADe Luca, LFerro, SAngeli, ACirilli, RSadutto, DAlterio, VMonti, SMSupuran, CTDe Simone, GGitto, R Probing Molecular Interactions between Human Carbonic Anhydrases (hCAs) and a Novel Class of Benzenesulfonamides. J Med Chem 60:4316-4326 (2017)  
Target
Name:
Carbonic anhydrase 7
Synonyms:
CA-VII CAH7_HUMAN Carbonic anhydrase Carbonic anhydrase VII (CA VII)
Type:
Enzyme
Mol. Mass.:
29664.11
Organism:
Homo sapiens (Human)
Description:
Human cloned isozyme.
Residue:
264
  
Inhibitor
Name:
BDBM50239278
Synonyms:
CHEMBL4095957
Type:
Small organic molecule
Emp. Form.:
C22H20N2O5S
Mol. Mass.:
424.47
SMILES:
NS(=O)(=O)c1ccc(cc1)C(=O)N1CCc2cc(O)c(O)cc2[C@@H]1c1ccccc1
: