Target
Bile salt export pump
Ligand
BDBM50010101
Substrate
Meas. Tech.
ChEMBL_1667662 (CHEMBL4017550)
IC50
40040±n/a nM
Citation
 Warner, DJChen, HCantin, LDKenna, JGStahl, SWalker, CLNoeske, T Mitigating the inhibition of human bile salt export pump by drugs: opportunities provided by physicochemical property modulation, in silico modeling, and structural modification. Drug Metab Dispos 40:2332-41 (2012)  
Target
Name:
Bile salt export pump
Synonyms:
ABCB11 ATP-binding cassette sub-family B member 11 Bile Salt Export Pump, BSEP Bile salt export pump (BSEP)
Type:
Protein
Mol. Mass.:
146405.49
Organism:
Homo sapiens (Human)
Description:
O95342
Residue:
1321
  
Inhibitor
Name:
BDBM50010101
Synonyms:
2-(diethylamino)ethyl 1-cyclohexylcyclohexanecarboxylate Bicyclohexyl-1-carboxylic acid 2-diethylamino-ethyl ester DICYCLOMINE | Dicycloverin
Type:
Small organic molecule
Emp. Form.:
C19H35NO2
Mol. Mass.:
309.4867
SMILES:
CCN(CC)CCOC(=O)C1(CCCCC1)C1CCCCC1
: