Target
Phosphatidylinositol 4,5-bisphosphate 3-kinase catalytic subunit delta isoform
Ligand
BDBM50380363
Substrate
Meas. Tech.
ChEMBL_1669404 (CHEMBL4019292)
IC50
110±n/a nM
Citation
 Beaufils, FCmiljanovic, NCmiljanovic, VBohnacker, TMelone, AMarone, RJackson, EZhang, XSele, ABorsari, CMestan, JHebeisen, PHillmann, PGiese, BZvelebil, MFabbro, DWilliams, RLRageot, DWymann, MP 5-(4,6-Dimorpholino-1,3,5-triazin-2-yl)-4-(trifluoromethyl)pyridin-2-amine (PQR309), a Potent, Brain-Penetrant, Orally Bioavailable, Pan-Class I PI3K/mTOR Inhibitor as Clinical Candidate in Oncology. J Med Chem 60:7524-7538 (2017)  
Target
Name:
Phosphatidylinositol 4,5-bisphosphate 3-kinase catalytic subunit delta isoform
Synonyms:
PI3-kinase p110 subunit delta PI3-kinase subunit p110-delta PIK3CD Phosphatidylinositol 4,5-biphosphate 3-kinase catalytic subunit delta (PIK3CD) Phosphatidylinositol 4,5-bisphosphate 3-kinase 110 kDa catalytic subunit delta (PI3K delta) Phosphatidylinositol 4,5-bisphosphate 3-kinase catalytic subunit delta (PI3Kdelta) Phosphatidylinositol 4,5-bisphosphate 3-kinase catalytic subunit delta isoform (PI3K delta) Phosphatidylinositol 4,5-bisphosphate 3-kinase catalytic subunit delta isoform (PI3K-delta) Phosphatidylinositol 4,5-bisphosphate 3-kinase catalytic subunit delta isoform (PI3Kdelta)
Type:
Enzyme Subunit
Mol. Mass.:
119489.41
Organism:
Homo sapiens (Human)
Description:
O00329
Residue:
1044
  
Inhibitor
Name:
BDBM50380363
Synonyms:
CHEMBL2017974 | US10173995, Compound 1
Type:
Small organic molecule
Emp. Form.:
C18H21F3N6O2
Mol. Mass.:
410.3935
SMILES:
Nc1cc(c(cn1)-c1cc(nc(n1)N1CCOCC1)N1CCOCC1)C(F)(F)F
: