Target
Protein kinase C epsilon type
Ligand
BDBM50244449
Substrate
Meas. Tech.
ChEMBL_1670920 (CHEMBL4020949)
Ki
31±n/a nM
Citation
 Elhalem, EDonadío, LGZhou, XLewin, NEGarcia, LCLai, CCKelley, JAPeach, MLBlumberg, PMComin, MJ Exploring the influence of indololactone structure on selectivity for binding to the C1 domains of PKC?, PKC?, and RasGRP. Bioorg Med Chem 25:2971-2980 (2017)  
Target
Name:
Protein kinase C epsilon type
Synonyms:
KPCE_HUMAN PKCE Protein kinase C epsilon Protein kinase C, PKC; classical/novel nPKC-epsilon
Type:
Enzyme
Mol. Mass.:
83680.45
Organism:
Homo sapiens (Human)
Description:
The recombinant human PKC enzymes were produced using a baculovirus expression system in SF9 cells
Residue:
737
  
Inhibitor
Name:
BDBM50244449
Synonyms:
(E)-(2-(hydroxymethyl)-4-((1-methyl-1H-indol-3-yl)methylene)-5-oxo-tetrahydrofuran-2-yl)methyl 2-propylpentanoate | CHEMBL519741
Type:
Small organic molecule
Emp. Form.:
C24H31NO5
Mol. Mass.:
413.5066
SMILES:
CCCC(CCC)C(=O)OCC1(CO)C\C(=C/c2cn(C)c3ccccc23)C(=O)O1
: