Target
Receptor-type tyrosine-protein kinase FLT3
Ligand
BDBM28031
Substrate
Meas. Tech.
ChEMBL_1671227 (CHEMBL4021256)
IC50
18±n/a nM
Citation
 Zhao, YZhang, JZhuang, RHe, RXi, JPan, XShao, YPan, JSun, JCai, ZLiu, SHuang, WLv, X Synthesis and evaluation of a series of pyridine and pyrimidine derivatives as type II c-Met inhibitors. Bioorg Med Chem 25:3195-3205 (2017)  
Target
Name:
Receptor-type tyrosine-protein kinase FLT3
Synonyms:
CD135 FL cytokine receptor FLK2 FLT3 Fetal liver kinase-2 Fms-like tyrosine kinase 3 (Flt-3) STK-1 Stem cell tyrosine kinase 1
Type:
Enzyme
Mol. Mass.:
112888.62
Organism:
Homo sapiens (Human)
Description:
P36888
Residue:
993
  
Inhibitor
Name:
BDBM28031
Synonyms:
BMS-777607 | N-{4-[(2-amino-3-chloropyridin-4-yl)oxy]-3-fluorophenyl}-4-ethoxy-1-(4-fluorophenyl)-2-oxo-1,2-dihydropyridine-3-carboxamide
Type:
Small organic molecule
Emp. Form.:
C25H19ClF2N4O4
Mol. Mass.:
512.893
SMILES:
CCOc1ccn(-c2ccc(F)cc2)c(=O)c1C(=O)Nc1ccc(Oc2ccnc(N)c2Cl)c(F)c1
: