Target
Peroxisome proliferator-activated receptor gamma
Ligand
BDBM50030474
Substrate
Meas. Tech.
ChEMBL_1671636 (CHEMBL4021665)
IC50
22000±n/a nM
Citation
 Toyota, YNomura, SMakishima, MHashimoto, YIshikawa, M Structure-activity relationships of rosiglitazone for peroxisome proliferator-activated receptor gamma transrepression. Bioorg Med Chem Lett 27:2776-2780 (2017)  
Target
Name:
Peroxisome proliferator-activated receptor gamma
Synonyms:
NR1C3 PPAR-gamma PPARG_HUMAN Peroxisome proliferator-activated receptor gamma (PPAR gamma) Peroxisome proliferator-activated receptor gamma (PPARĪ³) peroxisome proliferator-activated receptor gamma isoform 2
Type:
Nuclear Receptor
Mol. Mass.:
57613.46
Organism:
Homo sapiens (Human)
Description:
P37231
Residue:
505
  
Inhibitor
Name:
BDBM50030474
Synonyms:
Avandamet Avandia CHEBI:50122 US10744117, Compound Rosiglitazone | US9562012, rosiglitazone
Type:
Small organic molecule
Emp. Form.:
C18H19N3O3S
Mol. Mass.:
357.427
SMILES:
CN(CCOc1ccc(CC2SC(=O)NC2=O)cc1)c1ccccn1
: