Target
Cannabinoid receptor 1
Ligand
BDBM50243588
Substrate
Meas. Tech.
ChEMBL_1672800 (CHEMBL4022829)
Ki
0.125893±n/a nM
Citation
 Xia, Lde Vries, HLenselink, EBLouvel, JWaring, MJCheng, LPahlén, SPetersson, MJSchell, POlsson, RIHeitman, LHSheppard, RJIJzerman, AP Structure-Affinity Relationships and Structure-Kinetic Relationships of 1,2-Diarylimidazol-4-carboxamide Derivatives as Human Cannabinoid 1 Receptor Antagonists. J Med Chem 60:9545-9564 (2017)  
Target
Name:
Cannabinoid receptor 1
Synonyms:
CANN6 CB-R CNR CNR1_HUMAN Cannabinoid receptor Cannabinoid receptor 1 (brain)
Type:
G Protein-Coupled Receptor (GPCR)
Mol. Mass.:
52868.96
Organism:
Homo sapiens (Human)
Description:
P21554
Residue:
472
  
Inhibitor
Name:
BDBM50243588
Synonyms:
CHEMBL4067800
Type:
Small organic molecule
Emp. Form.:
C26H30Cl2N4O4S
Mol. Mass.:
565.512
SMILES:
CCCCS(=O)(=O)Oc1ccc(cc1)-n1c(C)c(nc1-c1ccc(Cl)cc1Cl)C(=O)NN1CCCCC1
: