Target
Cannabinoid receptor 1
Ligand
BDBM50243625
Substrate
Meas. Tech.
ChEMBL_1672800 (CHEMBL4022829)
Ki
0.100000±n/a nM
Citation
 Xia, Lde Vries, HLenselink, EBLouvel, JWaring, MJCheng, LPahlén, SPetersson, MJSchell, POlsson, RIHeitman, LHSheppard, RJIJzerman, AP Structure-Affinity Relationships and Structure-Kinetic Relationships of 1,2-Diarylimidazol-4-carboxamide Derivatives as Human Cannabinoid 1 Receptor Antagonists. J Med Chem 60:9545-9564 (2017)  
Target
Name:
Cannabinoid receptor 1
Synonyms:
CANN6 CB-R CNR CNR1_HUMAN Cannabinoid receptor Cannabinoid receptor 1 (brain)
Type:
G Protein-Coupled Receptor (GPCR)
Mol. Mass.:
52868.96
Organism:
Homo sapiens (Human)
Description:
P21554
Residue:
472
  
Inhibitor
Name:
BDBM50243625
Synonyms:
CHEMBL4094098
Type:
Small organic molecule
Emp. Form.:
C25H18Cl2F4N4O4S
Mol. Mass.:
617.399
SMILES:
Cc1c(nc(-c2ccc(Cl)cc2Cl)n1-c1ccc(OS(=O)(=O)CCC(F)(F)F)cc1)C(=O)Nc1ccc(F)nc1
: