Target
Free fatty acid receptor 1
Ligand
BDBM50243999
Substrate
Meas. Tech.
ChEMBL_1673100 (CHEMBL4023129)
EC50
3060±n/a nM
Citation
 Shi, JGu, ZJurica, EAWu, XHaque, LEWilliams, KNHernandez, ASHong, ZGao, QDabros, MDavulcu, AHMathur, ARampulla, RAGupta, AKJayaram, RApedo, AMoore, DBLiu, HKunselman, LKBrady, EJWilkes, JJZinker, BACai, HShu, YZSun, QDierks, EAFoster, KAXu, CWang, TPanemangalore, RCvijic, MEXie, CCao, GGZhou, MKrupinski, JWhaley, JMRobl, JAEwing, WREllsworth, BA Discovery of Potent and Orally Bioavailable Dihydropyrazole GPR40 Agonists. J Med Chem 61:681-694 (2018)  
Target
Name:
Free fatty acid receptor 1
Synonyms:
FFAR1 G-protein Coupled Receptor 40 | GPR40
Type:
G Protein-Coupled Receptor (GPCR)
Mol. Mass.:
31473.32
Organism:
Homo sapiens (Human)
Description:
O14842
Residue:
300
  
Inhibitor
Name:
BDBM50243999
Synonyms:
CHEMBL4061053
Type:
Small organic molecule
Emp. Form.:
C27H32F3N3O4
Mol. Mass.:
519.5559
SMILES:
COc1cc(C)c(N2CCC(CC2)Oc2ccc(cc2)N2N=C([C@@H](C)[C@@H]2CC(O)=O)C(F)(F)F)c(C)c1
: