Target
Free fatty acid receptor 1
Ligand
BDBM50244023
Substrate
Meas. Tech.
ChEMBL_1673100 (CHEMBL4023129)
EC50
1200±n/a nM
Citation
 Shi, JGu, ZJurica, EAWu, XHaque, LEWilliams, KNHernandez, ASHong, ZGao, QDabros, MDavulcu, AHMathur, ARampulla, RAGupta, AKJayaram, RApedo, AMoore, DBLiu, HKunselman, LKBrady, EJWilkes, JJZinker, BACai, HShu, YZSun, QDierks, EAFoster, KAXu, CWang, TPanemangalore, RCvijic, MEXie, CCao, GGZhou, MKrupinski, JWhaley, JMRobl, JAEwing, WREllsworth, BA Discovery of Potent and Orally Bioavailable Dihydropyrazole GPR40 Agonists. J Med Chem 61:681-694 (2018)  
Target
Name:
Free fatty acid receptor 1
Synonyms:
FFAR1 G-protein Coupled Receptor 40 | GPR40
Type:
G Protein-Coupled Receptor (GPCR)
Mol. Mass.:
31473.32
Organism:
Homo sapiens (Human)
Description:
O14842
Residue:
300
  
Inhibitor
Name:
BDBM50244023
Synonyms:
CHEMBL4097617
Type:
Small organic molecule
Emp. Form.:
C24H29FN2O4
Mol. Mass.:
428.4965
SMILES:
COc1ccc(F)c(c1)N1CCC(CC1)Oc1ccc(cc1)N1CCC[C@@H]1CC(O)=O
: