Target
Free fatty acid receptor 1
Ligand
BDBM50244067
Substrate
Meas. Tech.
ChEMBL_1673100 (CHEMBL4023129)
EC50
510±n/a nM
Citation
 Shi, JGu, ZJurica, EAWu, XHaque, LEWilliams, KNHernandez, ASHong, ZGao, QDabros, MDavulcu, AHMathur, ARampulla, RAGupta, AKJayaram, RApedo, AMoore, DBLiu, HKunselman, LKBrady, EJWilkes, JJZinker, BACai, HShu, YZSun, QDierks, EAFoster, KAXu, CWang, TPanemangalore, RCvijic, MEXie, CCao, GGZhou, MKrupinski, JWhaley, JMRobl, JAEwing, WREllsworth, BA Discovery of Potent and Orally Bioavailable Dihydropyrazole GPR40 Agonists. J Med Chem 61:681-694 (2018)  
Target
Name:
Free fatty acid receptor 1
Synonyms:
FFAR1 G-protein Coupled Receptor 40 | GPR40
Type:
G Protein-Coupled Receptor (GPCR)
Mol. Mass.:
31473.32
Organism:
Homo sapiens (Human)
Description:
O14842
Residue:
300
  
Inhibitor
Name:
BDBM50244067
Synonyms:
CHEMBL4075946
Type:
Small organic molecule
Emp. Form.:
C24H24ClF4N3O3
Mol. Mass.:
513.912
SMILES:
C[C@H]1[C@H](CC(O)=O)N(N=C1C(F)(F)F)c1ccc(OC2CCN(CC2)c2cc(Cl)ccc2F)cc1
: